{"text_format":"1","workbook":"xlsx","n_sheets":5,"sheets":["Multilanguage Vendor Form","Blank Vendor Form Spanish","Industry Code","Incoterm2010","Translation"],"not_rendered":{"charts":0,"images":8,"macros":1,"external_links":0,"defined_names":4,"comments":0,"pivot_tables":0},"unopened":[],"bounds":{"document_bytes":16777216,"sheet_cells":100000,"rows_first":2000,"rows_last":500,"rows_between":2000,"halvings":0,"cell_chars":16384,"cell_head_chars":4096},"cells_cut":0,"cells_raw":0,"read":"whole","date_system":"1900"}

{"sheet":"Multilanguage Vendor Form","index":0,"n_rows":187,"n_cols":15,"rows_kept":187,"cut":false,"hidden":false,"merged":[[186,1,186,17],[175,5,175,8],[167,3,167,15],[169,5,169,15],[171,5,171,15],[173,5,173,8],[173,11,173,15],[159,5,159,15],[161,5,161,15],[163,5,163,8],[163,11,163,15],[165,5,165,8],[182,9,182,12],[178,2,178,16],[101,5,101,8],[103,3,103,15],[105,5,105,15],[99,11,99,15],[151,5,151,8],[151,11,151,15],[153,5,153,8],[155,3,155,15],[157,5,157,15],[141,2,141,16],[143,3,143,15],[147,5,147,15],[149,5,149,15],[145,5,145,15],[132,12,132,15],[134,12,134,15],[136,12,136,15],[138,12,138,15],[124,9,125,15],[107,5,107,15],[109,5,109,8],[109,11,109,15],[111,5,111,8],[134,5,134,8],[69,11,69,15],[71,5,71,8],[61,5,61,8],[123,3,123,8],[124,3,125,8],[99,5,99,8],[114,2,114,16],[73,3,73,15],[75,5,75,15],[93,3,93,15],[95,5,95,15],[97,5,97,15],[63,3,63,15],[65,5,65,15],[77,5,77,15],[81,5,81,8],[79,5,79,8],[79,11,79,15],[83,3,83,15],[85,5,85,15],[91,5,91,8],[89,5,89,8],[89,11,89,15],[87,5,87,15],[26,5,26,8],[37,2,37,16],[39,3,39,15],[28,12,28,15],[28,5,28,8],[30,5,30,8],[45,5,45,15],[43,5,43,15],[41,5,41,15],[32,5,32,8],[26,3,26,4],[26,9,26,15],[136,5,136,8],[138,5,138,8],[123,9,123,15],[180,6,180,7],[180,11,180,15],[67,5,67,15],[69,5,69,8],[21,5,21,10],[21,13,21,15],[47,11,47,15],[121,2,121,16],[59,11,59,15],[128,11,128,15],[59,5,59,8],[128,5,128,8],[130,5,130,15],[132,5,132,8],[57,5,57,15],[55,5,55,15],[53,5,53,15],[51,3,51,15],[47,5,47,8],[49,5,49,8],[24,5,24,8],[5,2,5,16],[11,2,11,16],[13,5,13,15],[9,5,9,9],[9,13,9,14],[15,5,15,10],[15,13,15,15],[17,5,17,10],[19,5,19,7],[19,9,19,10],[17,13,17,15],[19,13,19,15]]}
[2]
[]
[null,null,null,null,null,null,null,null,null,null,"Language selection:"]
[]
[]
[null,null,{"$f":"VLOOKUP(1,Translation!A2:F102,'Multilanguage Vendor Form'!A1,FALSE)","v":"Vendor Information Form"}]
[]
[null,null,null,null,null,null,{"$f":"VLOOKUP(2,Translation!A2:F102,'Multilanguage Vendor Form'!A1,FALSE)","v":"New Vendor:"},null,null,null,{"$f":"VLOOKUP(3,Translation!A2:F102,'Multilanguage Vendor Form'!A1,FALSE)","v":"Vendor Update:"}]
[]
[null,null,null,{"$f":"VLOOKUP(4,Translation!A2:F102,'Multilanguage Vendor Form'!A1,FALSE)","v":"Requestor:"},null,null,null,null,null,null,null,{"$f":"VLOOKUP(5,Translation!A2:F102,'Multilanguage Vendor Form'!A1,FALSE)","v":"Date:"}]
[]
[null,null,{"$f":"VLOOKUP(6,Translation!A2:F102,'Multilanguage Vendor Form'!A1,FALSE)","v":"General Information"}]
[]
[null,null,null,{"$f":"VLOOKUP(7,Translation!A2:F102,'Multilanguage Vendor Form'!A1,FALSE)","v":"Vendor Name:"}]
[]
[null,null,null,{"$f":"VLOOKUP(8,Translation!A2:F102,'Multilanguage Vendor Form'!A1,FALSE)","v":"Street:"},null,null,null,null,null,null,null,{"$f":"VLOOKUP(14,Translation!A2:F102,'Multilanguage Vendor Form'!A1,FALSE)","v":"House Number:"}]
[]
[null,null,null,{"$f":"VLOOKUP(10,Translation!A2:F102,'Multilanguage Vendor Form'!A1,FALSE)","v":"City:"},null,null,null,null,null,null,null,{"$f":"VLOOKUP(15,Translation!A2:F102,'Multilanguage Vendor Form'!A1,FALSE)","v":"ZIP Code:"}]
[]
[null,null,null,{"$f":"VLOOKUP(11,Translation!A2:F102,'Multilanguage Vendor Form'!A1,FALSE)","v":"Country:"},null,null,null,null,{"$f":"VLOOKUP(13,Translation!A2:F102,'Multilanguage Vendor Form'!A1,FALSE)","v":"P.O. Box:"},null,null,{"$f":"VLOOKUP(16,Translation!A2:F102,'Multilanguage Vendor Form'!A1,FALSE)","v":"Region/State:"}]
[]
[null,null,null,{"$f":"VLOOKUP(12,Translation!A2:F102,'Multilanguage Vendor Form'!A1,FALSE)","v":"Webiste:"},null,null,null,null,null,null,null,{"$f":"VLOOKUP(17,Translation!A2:F102,'Multilanguage Vendor Form'!A1,FALSE)","v":"Time Zone:"}]
[]
[]
[null,null,null,{"$f":"VLOOKUP(18,Translation!A2:F102,'Multilanguage Vendor Form'!A1,FALSE)","v":"Industry Code:"},null,null,null,null,null,null,{"$f":"IFERROR(VLOOKUP(F25,'Industry Code'!$A$1:$B$160,2,FALSE),\"\")","v":""}]
[]
[null,null,null,{"$f":"VLOOKUP(19,Translation!A2:F102,'Multilanguage Vendor Form'!A1,FALSE)","v":"Incoterms2010:"},null,null,null,null,null,{"$f":"IF(IFERROR(VLOOKUP(F27,Incoterm2010!$C$1:$D$14,2,FALSE),\"\")=0,\"\",IFERROR(VLOOKUP(F27,Incoterm2010!$C$1:$D$14,2,FALSE),\"\"))","v":""}]
[]
[null,null,null,{"$f":"VLOOKUP(20,Translation!A2:F102,'Multilanguage Vendor Form'!A1,FALSE)","v":"Federal Tax ID:"},null,null,null,null,null,{"$f":"VLOOKUP(24,Translation!A2:F102,'Multilanguage Vendor Form'!A1,FALSE)","v":"- OR -"},null,{"$f":"VLOOKUP(25,Translation!A2:F102,'Multilanguage Vendor Form'!A1,FALSE)","v":"SSN (Individuals):"}]
[]
[null,null,null,{"$f":"VLOOKUP(21,Translation!A2:F102,'Multilanguage Vendor Form'!A1,FALSE)","v":"VAT/RFC Number:"}]
[]
[null,null,null,{"$f":"VLOOKUP(22,Translation!A2:F102,'Multilanguage Vendor Form'!A1,FALSE)","v":"DUNS-#:"}]
[]
[null,null,null,{"$f":"VLOOKUP(23,Translation!A2:F102,'Multilanguage Vendor Form'!A1,FALSE)","v":"1099 Supplier?"},null,{"$f":"VLOOKUP(26,Translation!A2:F102,'Multilanguage Vendor Form'!A1,FALSE)","v":"Yes:"},null,{"$f":"VLOOKUP(27,Translation!A2:F102,'Multilanguage Vendor Form'!A1,FALSE)","v":"No:"}]
[]
[]
[null,null,{"$f":"VLOOKUP(28,Translation!A2:F102,'Multilanguage Vendor Form'!A1,FALSE)","v":"Supplier Contact Information"}]
[]
[null,null,null,{"$f":"VLOOKUP(29,Translation!A2:F102,'Multilanguage Vendor Form'!A1,FALSE)","v":"Sales"}]
[]
[null,null,null,{"$f":"VLOOKUP(30,Translation!A2:F102,'Multilanguage Vendor Form'!A1,FALSE)","v":"Contact Name:"}]
[]
[null,null,null,{"$f":"VLOOKUP(31,Translation!A2:F102,'Multilanguage Vendor Form'!A1,FALSE)","v":"Title:"}]
[]
[null,null,null,{"$f":"VLOOKUP(32,Translation!A2:F102,'Multilanguage Vendor Form'!A1,FALSE)","v":"E-Mail:"}]
[]
[null,null,null,{"$f":"VLOOKUP(33,Translation!A2:F102,'Multilanguage Vendor Form'!A1,FALSE)","v":"Telephone:"},null,null,null,null,null,null,{"$f":"VLOOKUP(35,Translation!A2:F102,'Multilanguage Vendor Form'!A1,FALSE)","v":"Fax:"}]
[]
[null,null,null,{"$f":"VLOOKUP(34,Translation!A2:F102,'Multilanguage Vendor Form'!A1,FALSE)","v":"Mobilephone:"}]
[]
[null,null,null,{"$f":"VLOOKUP(36,Translation!A2:F102,'Multilanguage Vendor Form'!A1,FALSE)","v":"Finance - Accounting"}]
[]
[null,null,null,{"$f":"VLOOKUP(30,Translation!A2:F102,'Multilanguage Vendor Form'!A1,FALSE)","v":"Contact Name:"}]
[]
[null,null,null,{"$f":"VLOOKUP(31,Translation!A2:F102,'Multilanguage Vendor Form'!A1,FALSE)","v":"Title:"}]
[]
[null,null,null,{"$f":"VLOOKUP(32,Translation!A2:F102,'Multilanguage Vendor Form'!A1,FALSE)","v":"E-Mail:"}]
[]
[null,null,null,{"$f":"VLOOKUP(33,Translation!A2:F102,'Multilanguage Vendor Form'!A1,FALSE)","v":"Telephone:"},null,null,null,null,null,null,{"$f":"VLOOKUP(35,Translation!A2:F102,'Multilanguage Vendor Form'!A1,FALSE)","v":"Fax:"}]
{"$rows_left_out":128}
{"sheet":"Blank Vendor Form Spanish","index":1,"n_rows":81,"n_cols":15,"rows_kept":81,"cut":false,"hidden":true,"merged":[[80,9,80,12],[67,11,67,15],[69,5,69,8],[69,11,69,15],[71,5,71,8],[71,11,71,15],[73,5,73,8],[73,11,73,15],[76,2,76,16],[78,6,78,7],[78,11,78,15],[49,5,49,15],[51,5,51,15],[63,5,63,8],[67,5,67,8],[43,5,43,8],[53,5,53,8],[43,11,43,15],[65,5,65,15],[45,3,45,15],[53,11,53,15],[56,2,56,16],[63,11,63,15],[47,5,47,15],[58,3,60,8],[58,9,60,15],[24,8,24,11],[26,8,26,11],[28,6,28,8],[28,12,28,15],[30,6,30,8],[33,2,33,16],[35,3,35,15],[37,5,37,15],[39,5,39,15],[41,5,41,15],[16,5,16,10],[5,2,5,16],[10,5,10,9],[10,13,10,14],[12,2,12,16],[14,5,14,15],[16,13,16,15],[18,5,18,10],[20,5,20,10],[22,5,22,7],[22,9,22,10],[18,13,18,15],[20,13,20,15],[22,13,22,15]]}
[]
[]
[]
[]
[]
[null,null,"Informacion Del Proveedor"]
[]
[null,null,null,null,null,null,"Proveedor Nuevo:",null,null,null,"Actualizacion Del Proveedor:"]
[]
[]
[null,null,null,"Solicitante:",null,null,null,null,null,null,null,"Fecha:"]
[]
[null,null,"General Information"]
[]
[null,null,null,"Nombre de la Empresa: "]
[]
[null,null,null,"Calle:",null,null,null,null,null,null,null,"Numero:"]
[]
[null,null,null,"Colonia:",null,null,null,null,null,null,null,"Codigo Postal:"]
[]
[null,null,null,"Cudad:",null,null,null,null,null,null,null,"Estado:"]
[]
[null,null,null,"Pais:",null,null,null,null,"P.O. Box:",null,null,"Zona Horaria:"]
[]
[null,null,null,"Codigo Industrial:",null,null,null,{"$f":"IFERROR(VLOOKUP(I25,'Industry Code'!$A$1:$B$160,2,FALSE),\"\")","v":""}]
[]
[null,null,null,"Condiciones De Batrega:",null,null,null,{"$f":"IFERROR(VLOOKUP(I27,#REF!,2,FALSE),\"\")","v":""}]
[]
[null,null,null,"Numero De Identificacion Fiscal:",null,null,null,null,null,"- O -",null,"NIT (Individuales):"]
[]
[null,null,null,"VAT/RFC Number:",null,null,null,null,null,null,"1099?","Si:",null,null,"No:"]
[]
[]
[null,null,"Referencias Comerciales"]
[]
[null,null,null,"Compras"]
[]
[null,null,null,"Contacto:"]
[]
[null,null,null,"Titulo:"]
[]
[null,null,null,"Correo Electronico:"]
[]
[null,null,null,"Telefono:",null,null,null,null,null,null,"Fax:"]
[]
[null,null,null,"Contabilidad"]
[]
[null,null,null,"Contacto:"]
[]
[null,null,null,"Titulo:"]
[]
[null,null,null,"Correo Electronico:"]
[]
[null,null,null,"Telefono:",null,null,null,null,null,null,"Fax:"]
[]
[]
[null,null,"Informacion Fiscal"]
[]
[null,null,null,"Para Proveedores Mexicanos\nLa información bancaria debe ser confirmada con la carátula del estado de cuenta bancario o algún otro documento que muestre el nombre de la compañía, la cuenta bancaria y la cuenta Clabe.",null,null,null,null,null,"Para Proveedores No Mexicanos\nLa información bancaria debe ser confirmada por una carta membretada de la empresa o banco en la que se proporcionen todos los datos bancarios, incluyendo el nombre completo de la empresa.  "]
[]
{"$rows_left_out":22}
{"sheet":"Industry Code","index":2,"n_rows":160,"n_cols":2,"rows_kept":160,"cut":false,"hidden":true,"merged":[]}
["activated charcoal",6]
["adhesives",363]
["administration",766]
["advertisement",802]
["agent",607]
["agent/sales",771]
["aluminium/brass",3]
["apprenticeship",414]
["apprentiships",15]
["auto aftermarket",18]
["auto industry",2]
["auto repair",19]
["automation",14]
["automobil dealership",367]
["banding",648]
["belt",654]
["boiler maker",262]
["books / magazines",43]
["building materials",48]
["bycecle",191]
["car rental",12]
["carpenter",647]
["carpets/curtains",681]
["chemicals",81]
["chrome",768]
["cleaning service",604]
["compressed air",106]
["construction",41]
["consulting",49]
["container",56]
["cooling system",371]
["copyshop",557]
["crane service",369]
["cupper",381]
["cylinder",862]
["development/CAD",87]
["doors (large)",688]
["drive systems",4]
["electric motors",151]
["electrical",147]
["electrical install.",154]
["electrical supplies",142]
["electrician",153]
["environment",721]
["farmer equip.",412]
["fastening systems",47]
["felt",762]
["FI ITA- audit",9990]
["filters",188]
["fittings",765]
["foam",656]
["foile sack",767]
["foils/sheets",182]
["forklift",645]
["freight forwarder",649]
["fuel",55]
["furnace builder",270]
["gardener",222]
["glazier",225]
["glew strips",366]
{"$rows_left_out":101}
{"sheet":"Incoterm2010","index":3,"n_rows":14,"n_cols":4,"rows_kept":14,"cut":false,"hidden":true,"merged":[[0,0,0,1],[8,0,8,1]]}
["RULES FOR ANY MODE OR MODES OF TRANSPORT",null,"Free on Board Pack Included","Use of non-DDP Incoterms must first be authorized by the Procurement dept."]
["EXW Ex Works","“Ex Works” means that the seller delivers when it places the goods at the disposal of the buyer at the seller’s premises or at another named place (i.e.,works, factory, warehouse, etc.). The seller does not need to load the goods on any collecting vehicle, nor does it need to clear the goods for export, where such clearance is applicable.","Free on Board Pack Excluded","Use of non-DDP Incoterms must first be authorized by the Procurement dept."]
["FCA Free Carrier","“Free Carrier” means that the seller delivers the goods to the carrier or another person nominated by the buyer at the seller’s premises or another named place. The parties are well advised to specify as clearly as possible the point within the named place of delivery, as the risk passes to the buyer at that point.",{"$f":"A2","v":"EXW Ex Works"},"Use of non-DDP Incoterms must first be authorized by the Procurement dept."]
["CPT Carriage Paid To","“Carriage Paid To” means that the seller delivers the goods to the carrier or another person nominated by the seller at an agreed place (if any such place is agreed between parties) and that the seller must contract for and pay the costs of carriage necessary to bring the goods to the named place of destination.","FCA Free Carrier","Use of non-DDP Incoterms must first be authorized by the Procurement dept."]
["CIP Carriage And Insurance Paid To","“Carriage and Insurance Paid to” means that the seller delivers the goods to the carrier or another person nominated by the seller at an agreed place (if any such place is agreed between parties) and that the seller must contract for and pay the costs of carriage necessary to bring the goods to the named place of destination.\n‘The seller also contracts for insurance cover against the buyer’s risk of loss of or damage to the goods during the carriage. The buyer should note that under CIP the seller is required to obtain insurance only on minimum cover. Should the buyer wish to have more insurance protection, it will need either to agree as much expressly with the seller or to make its own extra insurance arrangements.”","CPT Carriage Paid To","Use of non-DDP Incoterms must first be authorized by the Procurement dept."]
["DAT Delivered At Terminal","“Delivered at Terminal” means that the seller delivers when the goods, once unloaded from the arriving means of transport, are placed at the disposal of the buyer at a named terminal at the named port or place of destination. “Terminal” includes a place, whether covered or not, such as a quay, warehouse, container yard or road, rail or air cargo terminal. The seller bears all risks involved in bringing the goods to and unloading them at the terminal at the named port or place of destination.","CIP Carriage And Insurance Paid To","Use of non-DDP Incoterms must first be authorized by the Procurement dept."]
["DAP Delivered At Place","“Delivered at Place” means that the seller delivers when the goods are placed at the disposal of the buyer on the arriving means of transport ready for unloading at the named place of destination. The seller bears all risks involved in bringing the goods to the named place.","DAT Delivered At Terminal","Use of non-DDP Incoterms must first be authorized by the Procurement dept."]
["DDP Delivered Duty Paid","“Delivered Duty Paid” means that the seller delivers the goods when the goods are placed at the disposal of the buyer, cleared for import on the arriving means of transport ready for unloading at the named place of destination. The seller bears all the costs and risks involved in bringing the goods to the place of destination and has an obligation to clear the goods not only for export but also for import, to pay any duty for both export and import and to carry out all customs formalities.","DAP Delivered At Place"]
["RULES FOR SEA AND INLAND WATERWAY TRANSPORT",null,"DDP Delivered Duty Paid","Use of non-DDP Incoterms must first be authorized by the Procurement dept."]
["FAS Free Alongside Ship","“Free Alongside Ship” means that the seller delivers when the goods are placed alongside the vessel (e.g., on a quay or a barge) nominated by the buyer at the named port of shipment. The risk of loss of or damage to the goods passes when the goods are alongside the ship, and the buyer bears all costs from that moment onwards.",{"$f":"A10","v":"FAS Free Alongside Ship"},"Use of non-DDP Incoterms must first be authorized by the Procurement dept."]
["FOB Free On Board","“Free On Board” means that the seller delivers the goods on board the vessel nominated by the buyer at the named port of shipment or procures the goods already so delivered. The risk of loss of or damage to the goods passes when the goods are on board the vessel, and the buyer bears all costs from that moment onwards.",{"$f":"A11","v":"FOB Free On Board"},"Use of non-DDP Incoterms must first be authorized by the Procurement dept."]
["CFR Cost and Freight","“Cost and Freight” means that the seller delivers the goods on board the vessel or procures the goods already so delivered. The risk of loss of or damage to the goods passes when the goods are on board the vessel. the seller must contract for and pay the costs and freight necessary to bring the goods to the named port of destination.",{"$f":"A12","v":"CFR Cost and Freight"},"Use of non-DDP Incoterms must first be authorized by the Procurement dept."]
["CIF Cost, Insurance and Freight","“Cost, Insurance and Freight” means that the seller delivers the goods on board the vessel or procures the goods already so delivered. The risk of loss of or damage to the goods passes when the goods are on board the vessel. The seller must contract for and pay the costs and freight necessary to bring the goods to the named port of destination.\n‘The seller also contracts for insurance cover against the buyer’s risk of loss of or damage to the goods during the carriage. The buyer should note that under CIF the seller is required to obtain insurance only on minimum cover. Should the buyer wish to have more insurance protection, it will need either to agree as much expressly with the seller or to make its own extra insurance arrangements.”",{"$f":"A13","v":"CIF Cost, Insurance and Freight"},"Use of non-DDP Incoterms must first be authorized by the Procurement dept."]
[null,null,"Delivered Duty Unpaid","Use of non-DDP Incoterms must first be authorized by the Procurement dept."]

{"sheet":"Translation","index":4,"n_rows":102,"n_cols":6,"rows_kept":102,"cut":false,"hidden":true,"merged":[]}
["Item","English","Italien","German","Chinese","Spanish"]
[null,2,3,4,5,6]
[1,"Vendor Information Form","MODULO INFORMAZIONI FORNITORE","Lieferantendatenblatt","供应商信息表","HOJA DE INFORMACIÓN DEL PROVEEDOR"]
[2,"New Vendor:","Nuovo fornitore:","Neuer Lieferant:","新供应商:","Nuevo proveedor:"]
[3,"Vendor Update:","Aggiornamento dati fornitore:","Lieferantenaktualisierung:","供应商更新:","Actualización proveedor:"]
[4,"Requestor:","Richiedente:","Beantrager:","申请人:","Solicitante:"]
[5,"Date:","Data:","Datum:","日期:","Fecha:"]
[6,"General Information","INFORMAZIONI GENERALI","Allgemeine Information","基本信息","INFORMACIÓN GENERAL:"]
[7,"Vendor Name:","Ragione sociale:","Name der Firma:","供应商名称:","Nombre de Empresa:"]
[8,"Street:","Via:","Strasse:","街道:","Calle:"]
[9]
[10,"City:","Cittá:","Ort:","城市:","Ciudad:"]
[11,"Country:","Paese:","Land:","国家:","País:"]
[12,"Webiste:","Sito Internet:","Internet site:","网址:","Página Web:"]
[13,"P.O. Box:","Casella P.:","Postfach:","邮箱:","A. Correos:"]
[14,"House Number:","Numero civico:","Hausnummer:","门牌号:","Número :"]
[15,"ZIP Code:","C.A.P.:","Postleitzahl:","邮箱:","Código Postal:"]
[16,"Region/State:","Provincia:","Region/ Staat:","省份:","Provincia:"]
[17,"Time Zone:","Fuso orario:","Zeitzone:","时区:","Zona Horaria:"]
[18,"Industry Code:","Codice di settore:","Branchencode:","工业代码(SAP代码):","Código de la industria:"]
[19,"Incoterms2010:","Incoterms 2010:","Incoterms 2010:","贸易方式:","Incoterms 2010:"]
[20,"Federal Tax ID:","Codice fiscale:","Bundessteuer-ID:","聯邦稅號:","ID de impuestos federales:"]
[21,"VAT/RFC Number:","Partita IVA:","Ust-Id. Nr.:","税号:","CIF:"]
[22,"DUNS-#:","DUNS-Code:","DUNS-#:","邓白氏编码","DUNS-#:"]
[23,"1099 Supplier?","Codice 1099","1099 Lieferant?","1099 供应商?","1099 Proveedora?"]
[24,"- OR -","- oppure -","- oder -","- 或 -","- o -"]
[25,"SSN (Individuals):","SSN","SSN","社会安全号码","SSN"]
[26,"Yes:","Si :","Ja:","是:","Si:"]
[27,"No:","No:","Nein:","否:","No:"]
[28,"Supplier Contact Information","INFORMAZIONI INERENTI I CONTATTI DEL FORNITORE","Lieferantenkontakt Information","供应商联系方式","INFORMACIÓN DE CONTACTO DEL PROVEEDOR"]
[29,"Sales","Reparto Vendite","Vertrieb","销售","Ventas"]
[30,"Contact Name:","Referente:","Ansprechpartner:","联系人名:","Contacto:"]
[31,"Title:","Posizione:","Titel:","职位:","Título:"]
[32,"E-Mail:","E-Mail:","E-Mail:","邮箱:","E-Mail:"]
[33,"Telephone:","Telefono:","Telefon:","电话:","Teléfono:"]
[34,"Mobilephone:","Cellulare:","Handy:","手机:","Móvil:"]
[35,"Fax:","FAX:","FAX:","传真:","FAX:"]
[36,"Finance - Accounting","Amministrazione - Contabilitá","Buchhaltung","财务联系人","Contabilidad"]
[37,"Plant Manager if applicable","Direttore di stabilimento (se ricorre)","Werksleitung ","工厂厂长（如适用）","Director de Planta (si procede)"]
[38,"Quality Manager if applicable","Responsabile Qualitá (se ricorre)","Qualitätsleitung","质量经理（如适用）","Responsable de Calidad (si procede)"]
[39,"Logistic Manager if applicable","Responsabile Logistica (se ricorre)","Logistikleitung","物流经理（如适用）","Responsable de Logística (si procede)"]
[40,"Customer Service","Servizio clienti","Kundenservice","关务联系人","Atención al cliente"]
[41,"24h Emergency Contact","Contatto per reperibilita 24 ore","24 Stunden Notkontakt","24紧急联系人","Contacto Emergencias 24h"]
[42,"Logistic Info","MODALITÁ TRASMISSIONE DATI","Logistische Information","物流信息","INFORMACIÓN DE LOGÍSTICA"]
[43,"EDI capable:","Collegamento EDI disponibile:","EDI:","EDI 适用:","EDI disponible:"]
[44,"If no: Is Pool4Tool available?","oppure Pool4Tool è disponibile?","Wenn nein, ist Pool-4-Tool vorhanden?","如果否：Pool4Tool是否可用?","Si no: ¿Está disponible Pool4Tool?"]
[45,"If no, set-up needed:","Altrimenti è necessario il setup:","Wenn nein, Setup erforderlich:","不，需要安装:","Si no es así, configuración necesaria:"]
[46,"Payment Information","INFORMAZIONI RELATIVE AI PAGAMENTI","Zahlungskonditionen","付款信息","INFORMACIÓN RELATIVA AL PAGO"]
[47,"Mexican Vendors","Fornitori","Mexikanische Lieferanten","墨西哥供应商","Proveedores Mexicanos"]
[48,"Banking information must be confirmed by providing a bank statement cover sheet or other which shows the company name, bank account number and CLABE.","Le informazioni bancarie, inclusa la ragione sociale completa dell'azienda, devono essere confermate su carta intestata della societá o della banca.","Die Bankdaten müssen bestätigt werden, indem Sie ein Deckblatt für ein Kontoauszug oder ein anderes Dokument vorlegen, das den Firmennamen, die Bankkontonummer und die CLABE enthält.","银行信息必须通过提供银行对帐单或其他显示公司名称，银行帐号和CLABE的信息进行确认.","Los datos bancarios deben ser confirmados mediante un extracto de la cuenta bancaria u otro documento que acredite el nombre de la empresa, nº de cuenta bancaria y CLABE."]
[49,"Non-Mexican Vendors","Solo per Fornitori Messicani ","Nicht Mexikanische Lieferanten","非墨西哥供应商","Proveedores No Mexicanos"]
[50,"Banking information must be confirmed by a letter on company or bank \nletterhead which provides all banking data, including the full company name.","Le informazioni bancarie devono essere confermate fornendo un estratto conto bancario o altro che riporti la ragione sociale, il numero di conto bancario e il CLABE.","Bankinformationen müssen durch ein Schreiben des Unternehmens oder der Bank bestätigt werden, durch einen Briefkopf, der alle Bankdaten einschließlich des vollständigen Firmennamens enthält.","银行信息必须通过公司或银行的信函确认\n信头，提供所有银行数据，包括完整的公司名称.","Los datos bancarios deben ser confirmados mediante una carta \ncon membrete de la empresa o del banco, en la cual se indiquen los datos bancarios así como los datos completos de la empresa."]
[51,"Bank Name:","Nome Banca:","Name der Bank:","银行名称:","Nombre del Banco:"]
[52,"Bank Address:","Indirizzo Banca:","Adresse der Bank:","银行地址:","Dirección del Banco:"]
[53,"Account Number:","Conto nr.:","Kontonummer:","银行账号:","Número de Cuenta:"]
[54,"SWIFT:","SWIFT:","SWIFT:","SWIFT 银行国际代码:","SWIFT:"]
[55,"IBAN:","IBAN:","IBAN:","IBAN 国际银行帐户号码:","IBAN:"]
[56,"CLABE:","CLABE:","CLABE:","CLABE:","CLABE:"]
[57,"Country:","Paese:","Land:","国家:","País:"]
[58,"ACH Routing Nr:","Codice ACH (se ricorre):","ACH Nummer:","ACH路由号码:","Código ACH (si procede):"]
{"$rows_left_out":42}